{"text_format":"1","workbook":"xlsx","n_sheets":7,"sheets":["Reisek.","VSt.Verpfl.","Städte","Staaten","Fahrzeug","Kontenplan","__Goal_Metadata"],"not_rendered":{"charts":0,"images":0,"macros":1,"external_links":0,"defined_names":10,"comments":4,"pivot_tables":0},"unopened":[],"bounds":{"document_bytes":16777216,"sheet_cells":100000,"rows_first":2000,"rows_last":500,"rows_between":2000,"halvings":0,"cell_chars":16384,"cell_head_chars":4096},"cells_cut":0,"cells_raw":0,"read":"whole","date_system":"1900"}

{"sheet":"Reisek.","index":0,"n_rows":55,"n_cols":29,"rows_kept":55,"cut":false,"hidden":false,"merged":[[46,18,47,18],[4,14,5,14],[1,19,1,22],[46,19,47,19],[46,20,47,20],[46,22,47,22],[4,20,5,22],[4,18,5,18],[4,12,4,13],[5,12,5,13],[46,11,47,11],[4,17,5,17],[4,15,5,15],[4,16,5,16],[46,12,47,12],[52,3,52,6],[1,0,1,8],[54,8,54,9],[4,2,4,3],[4,6,4,7],[5,6,5,7],[6,6,6,7],[7,6,7,7],[44,3,44,10]]}
[null,null,null,null,null,null,null,null,null,{"$f":"IF(J2>K2,\"' Datum von ' größer als ' Datum bis ' !\",IF(YEAR(J2)<YEAR(Y1),\"Datum < \"&TEXT(Y1,\"JJJJ\")&\" !\",IF(YEAR(J2)>YEAR(Z1),\"Datum > \"&TEXT(Z1,\"JJJJ\")&\" !\",\"\")))","v":""},{"$f":"IF(YEAR(K2)<YEAR(Y1),\"Datum < \"&TEXT(X1,\"JJJJ\")&\" !\",IF(YEAR(K2)>YEAR(Z1),\"Datum > \"&TEXT(Z1,\"JJJJ\")&\" !\",\"\"))","v":""},null,null,null,null,null,null,null,null,null,null,null,null,null,"2017-01-01","2020-12-31"]
["Reisekosten-Abrechnung",null,null,null,null,null,null,null,null,{"$f":"Z11","v":"2020-01-01"},{"$f":"Z15","v":"2020-01-31"},null,null,null,null,null,null,null,null,"Thomas Mustermann",null,null,null,null,null,"Pkw"]
["A",null,"(A = Arbeitnehmer, bei Erstattung durch Arbeitgeber)"]
[null,null,"(U = Unternehmer und Werbungskosten als Arbeitnehmer)",null,null,null,null,null,null,null,null,null,null,null,null,null,null,null,null,null,null,null,null,null,"A","Motorr."]
["Datum","Datum","Uhrzeit",null,"Uhrzeit",null,"Stunden",null,"\nGeschäftspartner","Ort","Staat","Verpflegungs-\nmehraufwand","Übernachtung\n- Pauschale -",null,"Kilometergeld","zusätzl.Personen","Fahrzeug","km-Satz","Summe","Bewirtungs-","\n\n\nsonstige Kosten",null,null,null,"U","Krad"]
[null,null,"von","bis","von","bis",null,null,"Reisezweck",null,null,"- Pauschale -","Kürzung Frühstück",null,null,null,null,null,null,"kosten 19%",null,null,null,null,null,"Moped"]
[null,null,null,null,null,null,null,null,null,null,null,"€",{"$f":"L7","v":"€"},"J/N","km","Anzahl","Typ",{"$f":"L7","v":"€"},{"$f":"L7","v":"€"},{"$f":"L7","v":"€"},{"$f":"L7","v":"€"},null,"Kontierung",null,null,"Mofa"]
[null,null,null,null,null,null,null,null,null,null,null,null,null,null,null,null,null,null,null,null,null,null,null,null,null,"Fahrrad"]
[]
[null,{"$f":"IF(OR(A10=\"\",A10=3112),J2-1,DATE(Jahr,RIGHT(A10,2),LEFT(A10,LEN(A10)-2)))","v":"2019-12-31"},null,null,{"$f":"IF(C10=\"\",F8,IF(LEN(C10)=1,\"00:0\"&C10,IF(LEN(C10)=2,\"00:\"&C10,IF(LEN(C10)=3,\"0\"&LEFT(C10,1)&\":\"&RIGHT(C10,2),IF(LEN(C10)=4,LEFT(C10,2)&\":\"&RIGHT(C10,2),0)))))","v":"00:00:00"},{"$f":"IF(LEN(D10)=1,\"00:0\"&D10,IF(LEN(D10)=2,\"00:\"&D10,IF(LEN(D10)=3,\"0\"&LEFT(D10,1)&\":\"&RIGHT(D10,2),IF(LEN(D10)=4,LEFT(D10,2)&\":\"&RIGHT(D10,2),0))))","v":"00:00:00"},{"$f":"IF(OR(C10=\"\",D10=\"\"),0,IF(OR(B10<=0,C10=\"\"),0,IF(OR(RIGHT(C10,2)*1>59,RIGHT(D10,2)*1>59),\"X\",F10-E10)))","v":0},null,null," ",{"$f":"IF(ISERROR(VLOOKUP(J10,Städte!$A$2:$B$1030,2,0)),\" \",VLOOKUP(J10,Städte!$A$2:$B$1030,2,0))","v":" "},{"$f":"IF(OR(D10>2400,D11>2400,G10=\"X\",G11=\"X\"),\"Uhrzeit prüfen!\",IF(OR(J11<>\"\",L11<>\"\"),\"\",IF(AND(G10+G11>8/24,G10+G11<24/24),VLOOKUP(K10,Staaten!$A$7:$D$336,3,0),IF(OR(AND(B10-B8=1,D8=2400,ISNUMBER(C10),C10=0,G10<1),AND(B12-B10=1,C12=0,D10=2400,G10<1)),VLOOKUP(K10,Staaten!$A$7:$D$336,4,0),IF(G10+G11>=24/24,VLOOKUP(K10,Staaten!$A$7:$B$336,2,0),\"\")))))","v":""},{"$f":"IF(AND($A$3=\"A\",B10+100-B11<>0,N10=\"N\"),VLOOKUP(K10,Staaten!$A$7:$E$366,5,FALSE),IF(AND($A$3=\"U\",B10+100-B11<>0,N10=\"N\"),VLOOKUP(K10,Staaten!$A$4:$I$366,9,FALSE),\" \"))","v":" "},null,null,1,null,{"$f":"IF(Q10=\"\",\"\",VLOOKUP(Q10,Fahrzeug!$A$2:$B$20,2,0))","v":""},{"$f":"IF(Q10=\"\",\" \",O10*R10)","v":" "},null,{"$f":"IF(RIGHT(W11,17)=\"Kürzung Pauschale\",-MIN(VLOOKUP(K10,Staaten!$A$7:$B$336,2,0)*LEFT(W11,4),L10),\"\")","v":""},null,{"$f":"IF(ISERROR(VLOOKUP(W11,Kontenplan!$A$4:$B$110,2,0)),\"\",IF($A$3=\"A\",VLOOKUP(W11,Kontenplan!$A$4:$B$110,2,0),IF(ISERROR(VLOOKUP(W11,Kontenplan!$A$4:$C$110,3,0)),\" \",IF($A$3=\"U\",VLOOKUP(W11,Kontenplan!$A$4:$C$110,3,0),\" \"))))","v":" "}]
[null,{"$f":"IF(A11=\"\",B10,DATE(Jahr,RIGHT(A11,2),LEFT(A11,LEN(A11)-2)))","v":"2019-12-31"},null,null,{"$f":"IF(C11=\"\",F10,IF(LEN(C11)=1,\"00:0\"&C11,IF(LEN(C11)=2,\"00:\"&C11,IF(LEN(C11)=3,\"0\"&LEFT(C11,1)&\":\"&RIGHT(C11,2),IF(LEN(C11)=4,LEFT(C11,2)&\":\"&RIGHT(C11,2),0)))))","v":"00:00:00"},{"$f":"IF(LEN(D11)=1,\"00:0\"&D11,IF(LEN(D11)=2,\"00:\"&D11,IF(LEN(D11)=3,\"0\"&LEFT(D11,1)&\":\"&RIGHT(D11,2),IF(LEN(D11)=4,LEFT(D11,2)&\":\"&RIGHT(D11,2),0))))","v":"00:00:00"},{"$f":"IF(OR(C11=\"\",D11=\"\"),0,IF(OR(B11<=0,C11=\"\"),0,IF(OR(RIGHT(C11,2)*1>59,RIGHT(D11,2)*1>59),\"X\",F11-E11)))","v":0},null,null,{"$f":"IF(OR(AND(C10=\"\",D10<>\"\"),AND(C11=\"\",D11<>\"\"),D10>2400,D11>2400,G10=\"X\",G11=\"X\"),\"Uhrzeit prüfen!\",IF(OR(AND(B9=B10,E10<F9),AND(A10<>\"\",B8=B10,E10<F8),AND(B10=B11,E11<F10)),\"Datum + Uhrzeit prüfen !\",IF(AND(E11+1-F10<>0,B10+1-B11=0),\"Datum + Uhrzeit prüfen !\",IF(AND(G10+G11>0,I10<=0),\"Geschäftspartner ?\",IF(AND(G10+G11>0,I11<=0),\"Reisezweck fehlt!\",IF(AND(G10+G11>0,J10<=0),\"Ort fehlt!\",IF(AND(G10+G11>0,J10=\" \"),\"Ort fehlt!\",\"\")))))))","v":""},{"$f":"VLOOKUP(K10,Staaten!$A$7:$G$347,7,0)","v":" "},{"$f":"IF(AND(D10>0,B10<=0),\"Datum fehlt !\",IF(AND(D11>0,B11<=0),\"Datum fehlt !\",IF(NOT(OR(B10=B11,B10+1=B11,B11<=0,)),\"Datum prüfen !\",IF(OR(AND(B9=B10,E10<F9),AND(B10=B11,E11<F10)),\"Datum + Uhrzeit prüfen !\",IF(AND(E11+1-F10<>0,B10+1=B11),\"Datum + Uhrzeit prüfen !\",IF(OR(AND(B10+1=B11,C10<1600),AND(B10+1=B11,D11>800)),\"Pauschale prüfen !\",\"\"))))))","v":""},{"$f":"IF(N10=\"J\",VLOOKUP(K10,Staaten!$A$7:$F$366,6,FALSE),\" \")","v":" "},null,null,null,null,null,null,null,null,null," ",null,null,{"$f":"DATE(Z14,Z13,Z12)","v":"2020-01-01"},{"$f":"Z11-1","v":"2019-12-31"}]
[null,{"$f":"IF(A12=\"\",B10,DATE(Jahr,RIGHT(A12,2),LEFT(A12,LEN(A12)-2)))","v":"2019-12-31"},null,null,{"$f":"IF(C12=\"\",F11,IF(LEN(C12)=1,\"00:0\"&C12,IF(LEN(C12)=2,\"00:\"&C12,IF(LEN(C12)=3,\"0\"&LEFT(C12,1)&\":\"&RIGHT(C12,2),IF(LEN(C12)=4,LEFT(C12,2)&\":\"&RIGHT(C12,2),0)))))","v":"00:00:00"},{"$f":"IF(LEN(D12)=1,\"00:0\"&D12,IF(LEN(D12)=2,\"00:\"&D12,IF(LEN(D12)=3,\"0\"&LEFT(D12,1)&\":\"&RIGHT(D12,2),IF(LEN(D12)=4,LEFT(D12,2)&\":\"&RIGHT(D12,2),0))))","v":"00:00:00"},{"$f":"IF(OR(C12=\"\",D12=\"\"),0,IF(OR(B12<=0,C12=\"\"),0,IF(OR(RIGHT(C12,2)*1>59,RIGHT(D12,2)*1>59),\"X\",F12-E12)))","v":0},null,null," ",{"$f":"IF(ISERROR(VLOOKUP(J12,Städte!$A$2:$B$1030,2,0)),\" \",VLOOKUP(J12,Städte!$A$2:$B$1030,2,0))","v":" "},{"$f":"IF(OR(D12>2400,D13>2400,G12=\"X\",G13=\"X\"),\"Uhrzeit prüfen!\",IF(OR(J13<>\"\",L13<>\"\"),\"\",IF(AND(G12+G13>8/24,G12+G13<24/24),VLOOKUP(K12,Staaten!$A$7:$D$336,3,0),IF(OR(AND(B12-B10=1,D10=2400,ISNUMBER(C12),C12=0,G12<1),AND(B14-B12=1,C14=0,D12=2400,G12<1)),VLOOKUP(K12,Staaten!$A$7:$D$336,4,0),IF(G12+G13>=24/24,VLOOKUP(K12,Staaten!$A$7:$B$336,2,0),\"\")))))","v":""},{"$f":"IF(AND($A$3=\"A\",B12+100-B13<>0,N12=\"N\"),VLOOKUP(K12,Staaten!$A$7:$E$366,5,FALSE),IF(AND($A$3=\"U\",B12+100-B13<>0,N12=\"N\"),VLOOKUP(K12,Staaten!$A$4:$I$366,9,FALSE),\" \"))","v":" "},null,null,null,null,{"$f":"IF(Q12=\"\",\"\",VLOOKUP(Q12,Fahrzeug!$A$2:$B$20,2,0))","v":""},{"$f":"IF(Q12=\"\",\" \",O12*R12)","v":" "},null,{"$f":"IF(RIGHT(W13,17)=\"Kürzung Pauschale\",-MIN(VLOOKUP(K12,Staaten!$A$7:$B$336,2,0)*LEFT(W13,4),L12),\"\")","v":""},null,{"$f":"IF(ISERROR(VLOOKUP(W13,Kontenplan!$A$4:$B$110,2,0)),\"\",IF($A$3=\"A\",VLOOKUP(W13,Kontenplan!$A$4:$B$110,2,0),IF(ISERROR(VLOOKUP(W13,Kontenplan!$A$4:$C$110,3,0)),\" \",IF($A$3=\"U\",VLOOKUP(W13,Kontenplan!$A$4:$C$110,3,0),\" \"))))","v":" "},null,null,1]
[null,{"$f":"IF(A13=\"\",B12,DATE(Jahr,RIGHT(A13,2),LEFT(A13,LEN(A13)-2)))","v":"2019-12-31"},null,null,"00:00:00","00:00:00",0,null,null,"",{"$f":"VLOOKUP(K12,Staaten!$A$7:$G$347,7,0)","v":" "},{"$f":"IF(AND(D12>0,B12<=0),\"Datum fehlt !\",IF(AND(D13>0,B13<=0),\"Datum fehlt !\",IF(NOT(OR(B12=B13,B12+1=B13,B13<=0,)),\"Datum prüfen !\",IF(OR(AND(B11=B12,E12<F11),AND(B12=B13,E13<F12)),\"Datum + Uhrzeit prüfen !\",IF(AND(E13+1-F12<>0,B12+1=B13),\"Datum + Uhrzeit prüfen !\",IF(OR(AND(B12+1=B13,C12<1600),AND(B12+1=B13,D13>800)),\"Pauschale prüfen !\",\"\"))))))","v":""},{"$f":"IF(N12=\"J\",VLOOKUP(K12,Staaten!$A$7:$F$366,6,FALSE),\" \")","v":" "},null,null,null,null,null,null,null,null,null," ",null,null,1]
[null,{"$f":"IF(A14=\"\",B12,DATE(Jahr,RIGHT(A14,2),LEFT(A14,LEN(A14)-2)))","v":"2019-12-31"},null,null,"00:00:00","00:00:00",0,null,null," ",{"$f":"IF(ISERROR(VLOOKUP(J14,Städte!$A$2:$B$1030,2,0)),\" \",VLOOKUP(J14,Städte!$A$2:$B$1030,2,0))","v":" "},{"$f":"IF(OR(D14>2400,D15>2400,G14=\"X\",G15=\"X\"),\"Uhrzeit prüfen!\",IF(OR(J15<>\"\",L15<>\"\"),\"\",IF(AND(G14+G15>8/24,G14+G15<24/24),VLOOKUP(K14,Staaten!$A$7:$D$336,3,0),IF(OR(AND(B14-B12=1,D12=2400,ISNUMBER(C14),C14=0,G14<1),AND(B16-B14=1,C16=0,D14=2400,G14<1)),VLOOKUP(K14,Staaten!$A$7:$D$336,4,0),IF(G14+G15>=24/24,VLOOKUP(K14,Staaten!$A$7:$B$336,2,0),\"\")))))","v":""},{"$f":"IF(AND($A$3=\"A\",B14+100-B15<>0,N14=\"N\"),VLOOKUP(K14,Staaten!$A$7:$E$366,5,FALSE),IF(AND($A$3=\"U\",B14+100-B15<>0,N14=\"N\"),VLOOKUP(K14,Staaten!$A$4:$I$366,9,FALSE),\" \"))","v":" "},null,null,null,null,{"$f":"IF(Q14=\"\",\"\",VLOOKUP(Q14,Fahrzeug!$A$2:$B$20,2,0))","v":""},{"$f":"IF(Q14=\"\",\" \",O14*R14)","v":" "},null,{"$f":"IF(RIGHT(W15,17)=\"Kürzung Pauschale\",-MIN(VLOOKUP(K14,Staaten!$A$7:$B$336,2,0)*LEFT(W15,4),L14),\"\")","v":""},null,{"$f":"IF(ISERROR(VLOOKUP(W15,Kontenplan!$A$4:$B$110,2,0)),\"\",IF($A$3=\"A\",VLOOKUP(W15,Kontenplan!$A$4:$B$110,2,0),IF(ISERROR(VLOOKUP(W15,Kontenplan!$A$4:$C$110,3,0)),\" \",IF($A$3=\"U\",VLOOKUP(W15,Kontenplan!$A$4:$C$110,3,0),\" \"))))","v":" "},null,null,2020]
[null,{"$f":"IF(A15=\"\",B14,DATE(Jahr,RIGHT(A15,2),LEFT(A15,LEN(A15)-2)))","v":"2019-12-31"},null,null,"00:00:00","00:00:00",0,null,null,"",{"$f":"VLOOKUP(K14,Staaten!$A$7:$G$347,7,0)","v":" "},{"$f":"IF(AND(D14>0,B14<=0),\"Datum fehlt !\",IF(AND(D15>0,B15<=0),\"Datum fehlt !\",IF(NOT(OR(B14=B15,B14+1=B15,B15<=0,)),\"Datum prüfen !\",IF(OR(AND(B13=B14,E14<F13),AND(B14=B15,E15<F14)),\"Datum + Uhrzeit prüfen !\",IF(AND(E15+1-F14<>0,B14+1=B15),\"Datum + Uhrzeit prüfen !\",IF(OR(AND(B14+1=B15,C14<1600),AND(B14+1=B15,D15>800)),\"Pauschale prüfen !\",\"\"))))))","v":""},{"$f":"IF(N14=\"J\",VLOOKUP(K14,Staaten!$A$7:$F$366,6,FALSE),\" \")","v":" "},null,null,null,null,null,null,null,null,null," ",null,null,{"$f":"DATE(Z18,Z17,Z16)","v":"2020-01-31"},{"$f":"Z15+1","v":"2020-02-01"}]
{"$rows_left_out":41}
{"sheet":"VSt.Verpfl.","index":1,"n_rows":53,"n_cols":11,"rows_kept":53,"cut":false,"hidden":false,"merged":[[1,8,1,10],[4,1,4,2],[1,0,1,5],[44,9,45,9],[44,10,45,10],[44,8,45,8],[5,7,5,8],[44,7,45,7],[44,6,45,6],[4,6,4,10],[50,2,50,3],[2,1,2,3],[4,3,4,4],[5,3,5,4],[6,3,6,4],[7,3,7,4],[44,1,44,5]]}
[]
["Vorsteuerabzug aus \nReisekosten-Abrechnung",null,null,null,null,null,null,null,{"$f":"Reisek.!T2","v":"Thomas Mustermann"}]
[null,{"$f":"Reisek.!J2","v":"2020-01-01"},null,null,null,{"$f":"Reisek.!K2","v":"2020-01-31"}]
[]
["Datum","Uhrzeit",null,"Stunden",null,"\nGeschäftspartner","Verpflegungsmehraufwand"]
[null,"von","bis",null,null,"Reisezweck","- Pauschale -","tatsächliche Kosten",null,"VSt.-Abzug aus","abziehbare VSt."]
[null,null,null,null,null,null,"€","€","% VSt.","€","€"]
[]
[{"$f":"IF(Reisek.!A10<=0,\" \",Reisek.!A10)","v":" "},{"$f":"IF(OR(Reisek.!E10=0,Reisek.!G10=0),\"\",Reisek.!E10)","v":""},{"$f":"IF(Reisek.!F10=0,\" \",Reisek.!F10)","v":" "},{"$f":"IF(Reisek.!G10=0,\" \",Reisek.!H10)","v":" "},null,{"$f":"IF(Reisek.!I10<=0,\" \",Reisek.!I10)","v":" "},{"$f":"IF(Reisek.!L10=\"\",0,Reisek.!L10)","v":0},null,null,{"$f":"IF(H9=\"\",\"\",IF(Reisek.!$A$3=\"U\",H9,IF(AND(Reisek.!$A$3=\"A\",(H9+H10)<=G9*(1+Reisek.!$C$45)),H9,\"\")))","v":""},{"$f":"IF(J9=\"\",\"\",ROUND(J9/(100+I9)*I9,2))","v":""}]
[{"$f":"IF(Reisek.!A11<=0,\" \",Reisek.!A11)","v":" "},{"$f":"IF(OR(Reisek.!E11=0,Reisek.!G11=0),\"\",Reisek.!E11)","v":""},{"$f":"IF(Reisek.!F11=0,\" \",Reisek.!F11)","v":" "},{"$f":"IF(Reisek.!G11=0,\" \",Reisek.!H11)","v":" "},null,{"$f":"IF(Reisek.!I11<=0,\" \",Reisek.!I11)","v":" "},{"$f":"IF(Reisek.!L11=\"\",0,Reisek.!L11)","v":0},null,null,{"$f":"IF(H10=\"\",\"\",IF(Reisek.!$A$3=\"U\",H10,IF(AND(Reisek.!$A$3=\"A\",(H9+H10)<=G9*(1+Reisek.!$C$45)),H10,\"\")))","v":""},{"$f":"IF(J10=\"\",\"\",ROUND(J10/(100+I10)*I10,2))","v":""}]
[{"$f":"IF(Reisek.!A12<=0,\" \",Reisek.!A12)","v":" "},{"$f":"IF(OR(Reisek.!E12=0,Reisek.!G12=0),\"\",Reisek.!E12)","v":""},{"$f":"IF(Reisek.!F12=0,\" \",Reisek.!F12)","v":" "},{"$f":"IF(Reisek.!G12=0,\" \",Reisek.!H12)","v":" "},null,{"$f":"IF(Reisek.!I12<=0,\" \",Reisek.!I12)","v":" "},{"$f":"IF(Reisek.!L12=\"\",0,Reisek.!L12)","v":0},null,null,{"$f":"IF(H11=\"\",\"\",IF(Reisek.!$A$3=\"U\",H11,IF(AND(Reisek.!$A$3=\"A\",(H11+H12)<=G11*(1+Reisek.!$C$45)),H11,\"\")))","v":""},{"$f":"IF(J11=\"\",\"\",ROUND(J11/(100+I11)*I11,2))","v":""}]
[{"$f":"IF(Reisek.!A13<=0,\" \",Reisek.!A13)","v":" "},{"$f":"IF(OR(Reisek.!E13=0,Reisek.!G13=0),\"\",Reisek.!E13)","v":""},{"$f":"IF(Reisek.!F13=0,\" \",Reisek.!F13)","v":" "},{"$f":"IF(Reisek.!G13=0,\" \",Reisek.!H13)","v":" "},null,{"$f":"IF(Reisek.!I13<=0,\" \",Reisek.!I13)","v":" "},{"$f":"IF(Reisek.!L13=\"\",0,Reisek.!L13)","v":0},null,null,{"$f":"IF(H12=\"\",\"\",IF(Reisek.!$A$3=\"U\",H12,IF(AND(Reisek.!$A$3=\"A\",(H11+H12)<=G11*(1+Reisek.!$C$45)),H12,\"\")))","v":""},""]
[{"$f":"IF(Reisek.!A14<=0,\" \",Reisek.!A14)","v":" "},{"$f":"IF(OR(Reisek.!E14=0,Reisek.!G14=0),\"\",Reisek.!E14)","v":""},{"$f":"IF(Reisek.!F14=0,\" \",Reisek.!F14)","v":" "},{"$f":"IF(Reisek.!G14=0,\" \",Reisek.!H14)","v":" "},null,{"$f":"IF(Reisek.!I14<=0,\" \",Reisek.!I14)","v":" "},{"$f":"IF(Reisek.!L14=\"\",0,Reisek.!L14)","v":0},null,null,{"$f":"IF(H13=\"\",\"\",IF(Reisek.!$A$3=\"U\",H13,IF(AND(Reisek.!$A$3=\"A\",(H13+H14)<=G13*(1+Reisek.!$C$45)),H13,\"\")))","v":""},""]
[{"$f":"IF(Reisek.!A15<=0,\" \",Reisek.!A15)","v":" "},{"$f":"IF(OR(Reisek.!E15=0,Reisek.!G15=0),\"\",Reisek.!E15)","v":""},{"$f":"IF(Reisek.!F15=0,\" \",Reisek.!F15)","v":" "},{"$f":"IF(Reisek.!G15=0,\" \",Reisek.!H15)","v":" "},null,{"$f":"IF(Reisek.!I15<=0,\" \",Reisek.!I15)","v":" "},{"$f":"IF(Reisek.!L15=\"\",0,Reisek.!L15)","v":0},null,null,{"$f":"IF(H14=\"\",\"\",IF(Reisek.!$A$3=\"U\",H14,IF(AND(Reisek.!$A$3=\"A\",(H13+H14)<=G13*(1+Reisek.!$C$45)),H14,\"\")))","v":""},""]
[{"$f":"IF(Reisek.!A16<=0,\" \",Reisek.!A16)","v":" "},{"$f":"IF(OR(Reisek.!E16=0,Reisek.!G16=0),\"\",Reisek.!E16)","v":""},{"$f":"IF(Reisek.!F16=0,\" \",Reisek.!F16)","v":" "},{"$f":"IF(Reisek.!G16=0,\" \",Reisek.!H16)","v":" "},null,{"$f":"IF(Reisek.!I16<=0,\" \",Reisek.!I16)","v":" "},{"$f":"IF(Reisek.!L16=\"\",0,Reisek.!L16)","v":0},null,null,{"$f":"IF(H15=\"\",\"\",IF(Reisek.!$A$3=\"U\",H15,IF(AND(Reisek.!$A$3=\"A\",(H15+H16)<=G15*(1+Reisek.!$C$45)),H15,\"\")))","v":""},""]
{"$rows_left_out":39}
{"sheet":"Städte","index":2,"n_rows":228,"n_cols":2,"rows_kept":228,"cut":false,"hidden":false,"merged":[]}
["Stadt","Staat"]
[" "," "]
["Accra","Ghana"]
["Abuja",{"$f":"A4","v":"Abuja"}]
["Addis Abeba","Äthiopien"]
["Aden","Jemen"]
["Algier","Algerien"]
["Alma-Ata","Kasachstan"]
["Amman","Jordanien"]
["Amsterdam","Niederlande"]
["Andorra la Vella","Andorra"]
["Ankara","TR - Türkei"]
["Antananarivo","Madagaskar"]
["Apia","Samoa"]
["Aschchabad","Turkmenistan"]
{"$rows_left_out":214}
{"sheet":"Staaten","index":3,"n_rows":267,"n_cols":9,"rows_kept":267,"cut":false,"hidden":false,"merged":[]}
["Dienst- und Geschäftsreisen","mind. 24 Std.","weniger als 24 Std.","Tag vor oder nach","Pauschbetrag für","Kürzung für"," "]
["in das Ausland",null,"aber mehr als 8 Std.","Übernachtung","Übernachtungsk.","Frühstück"," "]
[null,"€",{"$f":"B3","v":"€"},{"$f":"B3","v":"€"},{"$f":"B3","v":"€"},{"$f":"B3","v":"€"}," "]
[" ",{"$f":"IF(Jahr>=2020,28,24)","v":28},{"$f":"IF(Jahr>=2020,14,12)","v":14},14,0,{"$f":"B4*-0.2","v":-5.6000000000000005}," ","(Unternehmer)"]
["Inland",28,14,14,0,-5.6000000000000005," ","(Unternehmer)"]
["Deutschland",28,14,14,0,-5.6000000000000005," ","(Unternehmer)"]
["Inland",28,14,14,20,-5.6000000000000005," ","(Arbeitnehmer)"]
["Deutschland",28,14,14,20,-5.6000000000000005," ","(Arbeitnehmer)"]
[" ",28,14,14,20,-5.6000000000000005," ","(Arbeitnehmer)"]
["nicht in Tabelle",{"$f":"VLOOKUP(I10,Staaten!$A$13:$D$336,2,0)","v":47},{"$f":"ROUNDUP(B10/3*2,0)","v":32},{"$f":"C10","v":32},{"$f":"VLOOKUP(I10,Staaten!$A$13:$E$336,5,0)","v":130},-9.4,{"$f":"\"(wie \"&I10&\")\"","v":"(wie Luxemburg)"},null,"Luxemburg"]
["Schiffsreise",{"$f":"VLOOKUP(I11,Staaten!$A$13:$D$336,2,0)","v":47},{"$f":"ROUNDUP(B11/3*2,0)","v":32},32,{"$f":"VLOOKUP(I11,Staaten!$A$13:$E$336,5,0)","v":130},-9.4,{"$f":"\"(wie \"&I11&\")\"","v":"(wie Luxemburg)"},null,"Luxemburg"]
["Flugreise über 2 Tage",{"$f":"VLOOKUP(I12,Staaten!$A$13:$D$336,2,0)","v":40},{"$f":"ROUNDUP(B12/3*2,0)","v":27},27,{"$f":"VLOOKUP(I12,Staaten!$A$13:$E$336,5,0)","v":108},-8,"(wie A - Österreich)",null,"A - Österreich"]
[null,null,null,null,null,null," "]
["Afghanistan",30,{"$f":"ROUND(B14/3*2,0)","v":20},{"$f":"C14","v":20},95,{"$f":"B14*-0.2","v":-6}," "]
["Ägypten",{"$f":"IF(Jahr>=2018,41,40)","v":41},{"$f":"ROUNDUP(B15/3*2,0)","v":28},{"$f":"C15","v":28},{"$f":"IF(Jahr>=2018,125,113)","v":125},{"$f":"B15*-0.2","v":-8.2000000000000011}," "]
{"$rows_left_out":253}
{"sheet":"Fahrzeug","index":4,"n_rows":7,"n_cols":3,"rows_kept":7,"cut":false,"hidden":false,"merged":[]}
["Fahrzeug","km-Satz"]
["Pkw",0.3]
["Motorr.",0.2,"(für Motorrad oder Motorroller)"]
["Krad",0.2,"(für Motorrad oder Motorroller)"]
["Moped",0.2]
["Mofa",0.2]
["Fahrrad",0.05]

{"sheet":"Kontenplan","index":5,"n_rows":68,"n_cols":3,"rows_kept":68,"cut":false,"hidden":false,"merged":[]}
["Kontenplan Reisekosten"]
[null,"Arbeitnehmer","Unternehmer"]
[null,"Konto","Konto"]
[" "," "," "]
["Autobahngeb. 0%","10 6650","10 6670"]
["Autobahngeb.19%","90 6650","90 6670"]
["Benzin 0%","10 6530",{"$f":"B7","v":"10 6530"}]
["Benzin 19%","90 6530","90 6530"]
["Betriebsbedarf 0%","10 6850","10 6850"]
["Betriebsbedarf 19%","90 6850","90 6850"]
["Bewirtung 0%","10 6640","10 6640"]
["Bürobedarf 0%","10 6815","10 6815"]
["Bürobedarf 19%","90 6815","90 6815"]
["Diesel 0%","10 6530","10 6530"]
["Diesel 19%","90 6530","90 6530"]
{"$rows_left_out":54}
{"sheet":"__Goal_Metadata","index":6,"n_rows":2,"n_cols":2,"rows_kept":2,"cut":false,"hidden":true,"merged":[]}
["_KAW999934","J"]
["_KAW999120","K0000133"]