{"text_format":"1","workbook":"xlsx","n_sheets":6,"sheets":["Reisek.","VSt.Verpfl.","Staaten","Fahrzeug","Kontenplan","__Goal_Metadata"],"not_rendered":{"charts":0,"images":0,"macros":1,"external_links":0,"defined_names":6,"comments":3,"pivot_tables":0},"unopened":[],"bounds":{"document_bytes":16777216,"sheet_cells":100000,"rows_first":2000,"rows_last":500,"rows_between":2000,"halvings":0,"cell_chars":16384,"cell_head_chars":4096},"cells_cut":0,"cells_raw":0,"read":"whole","date_system":"1900"}

{"sheet":"Reisek.","index":0,"n_rows":80,"n_cols":25,"rows_kept":80,"cut":false,"hidden":false,"merged":[[1,15,1,18],[5,6,5,7],[5,12,5,13],[5,15,6,15],[5,16,6,18],[6,6,6,7],[6,12,6,13],[1,0,1,8],[5,2,5,3],[2,9,3,9],[2,11,3,11],[71,16,72,16],[71,18,72,18],[79,8,79,9],[71,11,72,11],[71,12,72,12],[71,14,72,14],[71,15,72,15],[77,3,77,6],[69,2,69,9],[70,2,70,9],[7,6,7,7],[8,6,8,7]]}
[null,null,null,null,null,null,null,null,null,{"$f":"IF(J2>L2,\"' Datum von ' größer als ' Datum bis ' !\",IF(YEAR(J2)<YEAR(U1),\"Datum < \"&TEXT(U1,\"JJJJ\")&\" !\",IF(YEAR(J2)>YEAR(V1),\"Datum > \"&TEXT(V1,\"JJJJ\")&\" !\",\"\")))","v":""},null,{"$f":"IF(YEAR(L2)<YEAR(U1),\"Datum < \"&TEXT(U1,\"JJJJ\")&\" !\",IF(YEAR(L2)>YEAR(V1),\"Datum > \"&TEXT(V1,\"JJJJ\")&\" !\",\"\"))","v":""},null,null,null,null,null,null,null,null,"2014-01-01","2020-12-31"]
["Reisekosten-Abrechnung",null,null,null,null,null,null,null,null,{"$f":"V10","v":"2020-01-01"},null,{"$f":"V14","v":"2020-01-31"},null,null,null,"Thomas Mustermann",null,null,null,null,null,"Pkw"]
[]
["A",null,"(A = Arbeitnehmer, bei Erstattung durch Arbeitgeber)",null,null,null,null,null,null,null,null,null,null,null,null,null,null,null,null,null,"A","Motorr."]
[null,null,"(U = Unternehmer und Werbungskosten als Arbeitnehmer)",null,null,null,null,null,null,null,null,null,null,null,null,null,null,null,null,null,"U","Krad"]
["Datum","Datum","Uhrzeit",null,"Uhrzeit",null,"Stunden",null,"\nGeschäftspartner","Ort","Staat","Verpflegungs-\nmehraufwand","Übernachtung\nohne USt.",null,"Bewirtungs-","Pkw","\n\n\nsonstige Kosten",null,null,null,null,"Moped"]
[null,null,"von","bis","von","bis",null,null,"Reisezweck",null,null,"- Pauschale -","Kürzung Frühstück",null,"kosten 16%",null,null,null,null,null,null,"Mofa"]
[null,null,null,null,null,null,null,null,null,null,null,"€",{"$f":"L8","v":"€"},"J/N",{"$f":"L8","v":"€"},"km",{"$f":"L8","v":"€"},null,"Kontierung",null,null,"Fahrrad"]
[]
[null,{"$f":"IF(OR(A10=\"\",A10=3112),J2-1,DATE(Jahr,RIGHT(A10,2),LEFT(A10,LEN(A10)-2)))","v":"2019-12-31"},null,null,{"$f":"IF(C10=\"\",F8,IF(LEN(C10)=1,\"00:0\"&C10,IF(LEN(C10)=2,\"00:\"&C10,IF(LEN(C10)=3,\"0\"&LEFT(C10,1)&\":\"&RIGHT(C10,2),IF(LEN(C10)=4,LEFT(C10,2)&\":\"&RIGHT(C10,2),0)))))","v":"00:00:00"},{"$f":"IF(LEN(D10)=1,\"00:0\"&D10,IF(LEN(D10)=2,\"00:\"&D10,IF(LEN(D10)=3,\"0\"&LEFT(D10,1)&\":\"&RIGHT(D10,2),IF(LEN(D10)=4,LEFT(D10,2)&\":\"&RIGHT(D10,2),0))))","v":"00:00:00"},{"$f":"IF(OR(C10=\"\",D10=\"\"),0,IF(OR(A10=\"\",C10=\"\"),0,IF(OR(RIGHT(C10,2)*1>59,RIGHT(D10,2)*1>59),\"X\",F10-E10)))","v":0},null,null,null," ",{"$f":"IF(OR(D10>2400,D11>2400,G10=\"X\",G11=\"X\"),\"Uhrzeit prüfen!\",IF(OR(J11<>\"\",L11<>\"\"),\"\",IF(AND(G10+G11>8/24,G10+G11<24/24),VLOOKUP(K10,Staaten!$A$7:$D$335,3,0),IF(OR(AND(B10-B8=1,D8=2400,ISNUMBER(C10),C10=0,G10<1),AND(B12-B10=1,C12=0,D10=2400,G10<1)),VLOOKUP(K10,Staaten!$A$7:$D$335,4,0),IF(G10+G11>=24/24,VLOOKUP(K10,Staaten!$A$7:$B$335,2,0),\"\")))))","v":""},{"$f":"IF(AND($A$4=\"A\",B10+100-B11<>0,N10=\"N\"),VLOOKUP(K10,Staaten!$A$7:$E$335,5,FALSE),IF(AND($A$4=\"U\",B10+100-B11<>0,N10=\"N\"),VLOOKUP(K10,Staaten!$A$4:$E$335,5,FALSE),\" \"))","v":" "},null,null,null,{"$f":"IF(LEFT(S11,4)=\"Kürz\",-MIN(LEFT(RIGHT(S11,7),5)*1,L10),IF(AND($A$4=\"A\",S11=\"Übern.Pauschale AN 20 €\"),20,\"\"))","v":""},null,{"$f":"IF(ISERROR(VLOOKUP(S11,Kontenplan!$A$4:$B$156,2,0)),\" \",IF($A$4=\"A\",VLOOKUP(S11,Kontenplan!$A$4:$B$156,2,0),IF(ISERROR(VLOOKUP(S11,Kontenplan!$A$4:$C$156,3,0)),\" \",IF($A$4=\"U\",VLOOKUP(S11,Kontenplan!$A$4:$C$156,3,0),\" \"))))","v":" "},null,null,{"$f":"DATE(V13,V12,V11)","v":"2020-01-01"},{"$f":"V10-1","v":"2019-12-31"}]
[null,{"$f":"IF(A11=\"\",B10,DATE(Jahr,RIGHT(A11,2),LEFT(A11,LEN(A11)-2)))","v":"2019-12-31"},null,null,{"$f":"IF(C11=\"\",F10,IF(LEN(C11)=1,\"00:0\"&C11,IF(LEN(C11)=2,\"00:\"&C11,IF(LEN(C11)=3,\"0\"&LEFT(C11,1)&\":\"&RIGHT(C11,2),IF(LEN(C11)=4,LEFT(C11,2)&\":\"&RIGHT(C11,2),0)))))","v":"00:00:00"},{"$f":"IF(LEN(D11)=1,\"00:0\"&D11,IF(LEN(D11)=2,\"00:\"&D11,IF(LEN(D11)=3,\"0\"&LEFT(D11,1)&\":\"&RIGHT(D11,2),IF(LEN(D11)=4,LEFT(D11,2)&\":\"&RIGHT(D11,2),0))))","v":"00:00:00"},{"$f":"IF(OR(C11=\"\",D11=\"\"),0,IF(OR(A11=\"\",C11=\"\"),0,IF(OR(RIGHT(C11,2)*1>59,RIGHT(D11,2)*1>59),\"X\",F11-E11)))","v":0},null,null,{"$f":"IF(OR(AND(C10=\"\",D10<>\"\"),AND(C11=\"\",D11<>\"\"),D10>2400,D11>2400,G10=\"X\",G11=\"X\"),\"Uhrzeit prüfen!\",IF(OR(AND(B9=B10,E10<F9),AND(A10<>\"\",B8=B10,E10<F8),AND(B10=B11,E11<F10)),\"Datum + Uhrzeit prüfen !\",IF(AND(E11+1-F10<>0,B10+1-B11=0),\"Datum + Uhrzeit prüfen !\",IF(AND(G10+G11>0,I10<=0),\"Geschäftspartner ?\",IF(AND(G10+G11>0,I11<=0),\"Reisezweck fehlt!\",IF(AND(G10+G11>0,J10<=0),\"Ort fehlt!\",IF(AND(G10+G11>0,J10=\" \"),\"Ort fehlt!\",\"\")))))))","v":""},null,{"$f":"IF(AND(D10>0,B10<=0),\"Datum fehlt !\",IF(AND(D11>0,B11<=0),\"Datum fehlt !\",IF(NOT(OR(B10=B11,B10+1=B11,B11<=0,)),\"Datum prüfen !\",IF(OR(AND(B9=B10,E10<F9),AND(B10=B11,E11<F10)),\"Datum + Uhrzeit prüfen !\",IF(AND(E11+1-F10<>0,B10+1=B11),\"Datum + Uhrzeit prüfen !\",IF(OR(AND(B10+1=B11,C10<1600),AND(B10+1=B11,D11>800)),\"Pauschale prüfen !\",\"\"))))))","v":""},{"$f":"IF(N10=\"J\",VLOOKUP(K10,Staaten!$A$7:$F$335,6,FALSE),\" \")","v":" "},null,null,null,null,null," ",null,null,1]
[null,{"$f":"IF(A12=\"\",B10,DATE(Jahr,RIGHT(A12,2),LEFT(A12,LEN(A12)-2)))","v":"2019-12-31"},null,null,{"$f":"IF(C12=\"\",F11,IF(LEN(C12)=1,\"00:0\"&C12,IF(LEN(C12)=2,\"00:\"&C12,IF(LEN(C12)=3,\"0\"&LEFT(C12,1)&\":\"&RIGHT(C12,2),IF(LEN(C12)=4,LEFT(C12,2)&\":\"&RIGHT(C12,2),0)))))","v":"00:00:00"},{"$f":"IF(LEN(D12)=1,\"00:0\"&D12,IF(LEN(D12)=2,\"00:\"&D12,IF(LEN(D12)=3,\"0\"&LEFT(D12,1)&\":\"&RIGHT(D12,2),IF(LEN(D12)=4,LEFT(D12,2)&\":\"&RIGHT(D12,2),0))))","v":"00:00:00"},{"$f":"IF(OR(C12=\"\",D12=\"\"),0,IF(OR(A12=\"\",C12=\"\"),0,IF(OR(RIGHT(C12,2)*1>59,RIGHT(D12,2)*1>59),\"X\",F12-E12)))","v":0},null,null,null," ",{"$f":"IF(OR(D12>2400,D13>2400,G12=\"X\",G13=\"X\"),\"Uhrzeit prüfen!\",IF(OR(J13<>\"\",L13<>\"\"),\"\",IF(AND(G12+G13>8/24,G12+G13<24/24),VLOOKUP(K12,Staaten!$A$7:$D$335,3,0),IF(OR(AND(B12-B10=1,D10=2400,ISNUMBER(C12),C12=0,G12<1),AND(B14-B12=1,C14=0,D12=2400,G12<1)),VLOOKUP(K12,Staaten!$A$7:$D$335,4,0),IF(G12+G13>=24/24,VLOOKUP(K12,Staaten!$A$7:$B$335,2,0),\"\")))))","v":""},{"$f":"IF(AND($A$4=\"A\",B12+100-B13<>0,N12=\"N\"),VLOOKUP(K12,Staaten!$A$7:$E$335,5,FALSE),IF(AND($A$4=\"U\",B12+100-B13<>0,N12=\"N\"),VLOOKUP(K12,Staaten!$A$4:$E$335,5,FALSE),\" \"))","v":" "},null,null,null,{"$f":"IF(LEFT(S13,4)=\"Kürz\",-MIN(LEFT(RIGHT(S13,7),5)*1,L12),IF(AND($A$4=\"A\",S13=\"Übern.Pauschale AN 20 €\"),20,\"\"))","v":""},null,{"$f":"IF(ISERROR(VLOOKUP(S13,Kontenplan!$A$4:$B$156,2,0)),\" \",IF($A$4=\"A\",VLOOKUP(S13,Kontenplan!$A$4:$B$156,2,0),IF(ISERROR(VLOOKUP(S13,Kontenplan!$A$4:$C$156,3,0)),\" \",IF($A$4=\"U\",VLOOKUP(S13,Kontenplan!$A$4:$C$156,3,0),\" \"))))","v":" "},null,null,1]
[null,{"$f":"IF(A13=\"\",B12,DATE(Jahr,RIGHT(A13,2),LEFT(A13,LEN(A13)-2)))","v":"2019-12-31"},null,null,"00:00:00","00:00:00",0,null,null,{"$f":"IF(OR(AND(C12=\"\",D12<>\"\"),AND(C13=\"\",D13<>\"\"),D12>2400,D13>2400,G12=\"X\",G13=\"X\"),\"Uhrzeit prüfen!\",IF(OR(AND(B11=B12,E12<F11),AND(A12<>\"\",B10=B12,E12<F10),AND(B12=B13,E13<F12)),\"Datum + Uhrzeit prüfen !\",IF(AND(E13+1-F12<>0,B12+1-B13=0),\"Datum + Uhrzeit prüfen !\",IF(AND(G12+G13>0,I12<=0),\"Geschäftspartner ?\",IF(AND(G12+G13>0,I13<=0),\"Reisezweck fehlt!\",IF(AND(G12+G13>0,J12<=0),\"Ort fehlt!\",IF(AND(G12+G13>0,J12=\" \"),\"Ort fehlt!\",\"\")))))))","v":""},null,{"$f":"IF(AND(D12>0,B12<=0),\"Datum fehlt !\",IF(AND(D13>0,B13<=0),\"Datum fehlt !\",IF(NOT(OR(B12=B13,B12+1=B13,B13<=0,)),\"Datum prüfen !\",IF(OR(AND(B11=B12,E12<F11),AND(B12=B13,E13<F12)),\"Datum + Uhrzeit prüfen !\",IF(AND(E13+1-F12<>0,B12+1=B13),\"Datum + Uhrzeit prüfen !\",IF(OR(AND(B12+1=B13,C12<1600),AND(B12+1=B13,D13>800)),\"Pauschale prüfen !\",\"\"))))))","v":""},{"$f":"IF(N12=\"J\",VLOOKUP(K12,Staaten!$A$7:$F$335,6,FALSE),\" \")","v":" "},null,null,null,null,null," ",null,null,2020]
[null,{"$f":"IF(A14=\"\",B12,DATE(Jahr,RIGHT(A14,2),LEFT(A14,LEN(A14)-2)))","v":"2019-12-31"},null,null,{"$f":"IF(C14=\"\",F13,IF(LEN(C14)=1,\"00:0\"&C14,IF(LEN(C14)=2,\"00:\"&C14,IF(LEN(C14)=3,\"0\"&LEFT(C14,1)&\":\"&RIGHT(C14,2),IF(LEN(C14)=4,LEFT(C14,2)&\":\"&RIGHT(C14,2),0)))))","v":"00:00:00"},{"$f":"IF(LEN(D14)=1,\"00:0\"&D14,IF(LEN(D14)=2,\"00:\"&D14,IF(LEN(D14)=3,\"0\"&LEFT(D14,1)&\":\"&RIGHT(D14,2),IF(LEN(D14)=4,LEFT(D14,2)&\":\"&RIGHT(D14,2),0))))","v":"00:00:00"},0,null,null,null," ",{"$f":"IF(OR(D14>2400,D15>2400,G14=\"X\",G15=\"X\"),\"Uhrzeit prüfen!\",IF(OR(J15<>\"\",L15<>\"\"),\"\",IF(AND(G14+G15>8/24,G14+G15<24/24),VLOOKUP(K14,Staaten!$A$7:$D$335,3,0),IF(OR(AND(B14-B12=1,D12=2400,ISNUMBER(C14),C14=0,G14<1),AND(B16-B14=1,C16=0,D14=2400,G14<1)),VLOOKUP(K14,Staaten!$A$7:$D$335,4,0),IF(G14+G15>=24/24,VLOOKUP(K14,Staaten!$A$7:$B$335,2,0),\"\")))))","v":""},{"$f":"IF(AND($A$4=\"A\",B14+100-B15<>0,N14=\"N\"),VLOOKUP(K14,Staaten!$A$7:$E$335,5,FALSE),IF(AND($A$4=\"U\",B14+100-B15<>0,N14=\"N\"),VLOOKUP(K14,Staaten!$A$4:$E$335,5,FALSE),\" \"))","v":" "},null,null,null,{"$f":"IF(LEFT(S15,4)=\"Kürz\",-MIN(LEFT(RIGHT(S15,7),5)*1,L14),IF(AND($A$4=\"A\",S15=\"Übern.Pauschale AN 20 €\"),20,\"\"))","v":""},null,{"$f":"IF(ISERROR(VLOOKUP(S15,Kontenplan!$A$4:$B$156,2,0)),\" \",IF($A$4=\"A\",VLOOKUP(S15,Kontenplan!$A$4:$B$156,2,0),IF(ISERROR(VLOOKUP(S15,Kontenplan!$A$4:$C$156,3,0)),\" \",IF($A$4=\"U\",VLOOKUP(S15,Kontenplan!$A$4:$C$156,3,0),\" \"))))","v":" "},null,null,{"$f":"DATE(V17,V16,V15)","v":"2020-01-31"},{"$f":"V14+1","v":"2020-02-01"}]
[null,{"$f":"IF(A15=\"\",B14,DATE(Jahr,RIGHT(A15,2),LEFT(A15,LEN(A15)-2)))","v":"2019-12-31"},null,null,"00:00:00","00:00:00",0,null,null,{"$f":"IF(OR(AND(C14=\"\",D14<>\"\"),AND(C15=\"\",D15<>\"\"),D14>2400,D15>2400,G14=\"X\",G15=\"X\"),\"Uhrzeit prüfen!\",IF(OR(AND(B13=B14,E14<F13),AND(A14<>\"\",B12=B14,E14<F12),AND(B14=B15,E15<F14)),\"Datum + Uhrzeit prüfen !\",IF(AND(E15+1-F14<>0,B14+1-B15=0),\"Datum + Uhrzeit prüfen !\",IF(AND(G14+G15>0,I14<=0),\"Geschäftspartner ?\",IF(AND(G14+G15>0,I15<=0),\"Reisezweck fehlt!\",IF(AND(G14+G15>0,J14<=0),\"Ort fehlt!\",IF(AND(G14+G15>0,J14=\" \"),\"Ort fehlt!\",\"\")))))))","v":""},null,{"$f":"IF(AND(D14>0,B14<=0),\"Datum fehlt !\",IF(AND(D15>0,B15<=0),\"Datum fehlt !\",IF(NOT(OR(B14=B15,B14+1=B15,B15<=0,)),\"Datum prüfen !\",IF(OR(AND(B13=B14,E14<F13),AND(B14=B15,E15<F14)),\"Datum + Uhrzeit prüfen !\",IF(AND(E15+1-F14<>0,B14+1=B15),\"Datum + Uhrzeit prüfen !\",IF(OR(AND(B14+1=B15,C14<1600),AND(B14+1=B15,D15>800)),\"Pauschale prüfen !\",\"\"))))))","v":""},{"$f":"IF(N14=\"J\",VLOOKUP(K14,Staaten!$A$7:$F$335,6,FALSE),\" \")","v":" "},null,null,null,null,null," ",null,null,{"$f":"SUM(W15:Y15)","v":0},31,{"$f":"V11-1","v":0},{"$f":"IF(V12=12,V11*-1+1,V11-X15-32)","v":-31}]
[null,{"$f":"IF(A16=\"\",B14,DATE(Jahr,RIGHT(A16,2),LEFT(A16,LEN(A16)-2)))","v":"2019-12-31"},null,null,"00:00:00","00:00:00",0,null,null,null," ",{"$f":"IF(OR(D16>2400,D17>2400,G16=\"X\",G17=\"X\"),\"Uhrzeit prüfen!\",IF(OR(J17<>\"\",L17<>\"\"),\"\",IF(AND(G16+G17>8/24,G16+G17<24/24),VLOOKUP(K16,Staaten!$A$7:$D$335,3,0),IF(OR(AND(B16-B14=1,D14=2400,ISNUMBER(C16),C16=0,G16<1),AND(B18-B16=1,C18=0,D16=2400,G16<1)),VLOOKUP(K16,Staaten!$A$7:$D$335,4,0),IF(G16+G17>=24/24,VLOOKUP(K16,Staaten!$A$7:$B$335,2,0),\"\")))))","v":""},{"$f":"IF(AND($A$4=\"A\",B16+100-B17<>0,N16=\"N\"),VLOOKUP(K16,Staaten!$A$7:$E$335,5,FALSE),IF(AND($A$4=\"U\",B16+100-B17<>0,N16=\"N\"),VLOOKUP(K16,Staaten!$A$4:$E$335,5,FALSE),\" \"))","v":" "},null,null,null,{"$f":"IF(LEFT(S17,4)=\"Kürz\",-MIN(LEFT(RIGHT(S17,7),5)*1,L16),IF(AND($A$4=\"A\",S17=\"Übern.Pauschale AN 20 €\"),20,\"\"))","v":""},null,{"$f":"IF(ISERROR(VLOOKUP(S17,Kontenplan!$A$4:$B$156,2,0)),\" \",IF($A$4=\"A\",VLOOKUP(S17,Kontenplan!$A$4:$B$156,2,0),IF(ISERROR(VLOOKUP(S17,Kontenplan!$A$4:$C$156,3,0)),\" \",IF($A$4=\"U\",VLOOKUP(S17,Kontenplan!$A$4:$C$156,3,0),\" \"))))","v":" "},null,null,{"$f":"IF(AND(V15>0,SUM(W16:X16)>12),12,IF(SUM(W16:X16)>13,13,SUM(W16:X16)))","v":2},1,{"$f":"V12","v":1}]
[null,{"$f":"IF(A17=\"\",B16,DATE(Jahr,RIGHT(A17,2),LEFT(A17,LEN(A17)-2)))","v":"2019-12-31"},null,null,"00:00:00","00:00:00",0,null,null,{"$f":"IF(OR(AND(C16=\"\",D16<>\"\"),AND(C17=\"\",D17<>\"\"),D16>2400,D17>2400,G16=\"X\",G17=\"X\"),\"Uhrzeit prüfen!\",IF(OR(AND(B15=B16,E16<F15),AND(A16<>\"\",B14=B16,E16<F14),AND(B16=B17,E17<F16)),\"Datum + Uhrzeit prüfen !\",IF(AND(E17+1-F16<>0,B16+1-B17=0),\"Datum + Uhrzeit prüfen !\",IF(AND(G16+G17>0,I16<=0),\"Geschäftspartner ?\",IF(AND(G16+G17>0,I17<=0),\"Reisezweck fehlt!\",IF(AND(G16+G17>0,J16<=0),\"Ort fehlt!\",IF(AND(G16+G17>0,J16=\" \"),\"Ort fehlt!\",\"\")))))))","v":""},null,{"$f":"IF(AND(D16>0,B16<=0),\"Datum fehlt !\",IF(AND(D17>0,B17<=0),\"Datum fehlt !\",IF(NOT(OR(B16=B17,B16+1=B17,B17<=0,)),\"Datum prüfen !\",IF(OR(AND(B15=B16,E16<F15),AND(B16=B17,E17<F16)),\"Datum + Uhrzeit prüfen !\",IF(AND(E17+1-F16<>0,B16+1=B17),\"Datum + Uhrzeit prüfen !\",IF(OR(AND(B16+1=B17,C16<1600),AND(B16+1=B17,D17>800)),\"Pauschale prüfen !\",\"\"))))))","v":""},{"$f":"IF(N16=\"J\",VLOOKUP(K16,Staaten!$A$7:$F$335,6,FALSE),\" \")","v":" "},null,null,null,null,null," ",null,null,{"$f":"V13","v":2020}]
[null,{"$f":"IF(A18=\"\",B16,DATE(Jahr,RIGHT(A18,2),LEFT(A18,LEN(A18)-2)))","v":"2019-12-31"},null,null,"00:00:00","00:00:00",0,null,null,null," ",{"$f":"IF(OR(D18>2400,D19>2400,G18=\"X\",G19=\"X\"),\"Uhrzeit prüfen!\",IF(OR(J19<>\"\",L19<>\"\"),\"\",IF(AND(G18+G19>8/24,G18+G19<24/24),VLOOKUP(K18,Staaten!$A$7:$D$335,3,0),IF(OR(AND(B18-B16=1,D16=2400,ISNUMBER(C18),C18=0,G18<1),AND(B20-B18=1,C20=0,D18=2400,G18<1)),VLOOKUP(K18,Staaten!$A$7:$D$335,4,0),IF(G18+G19>=24/24,VLOOKUP(K18,Staaten!$A$7:$B$335,2,0),\"\")))))","v":""},{"$f":"IF(AND($A$4=\"A\",B18+100-B19<>0,N18=\"N\"),VLOOKUP(K18,Staaten!$A$7:$E$335,5,FALSE),IF(AND($A$4=\"U\",B18+100-B19<>0,N18=\"N\"),VLOOKUP(K18,Staaten!$A$4:$E$335,5,FALSE),\" \"))","v":" "},null,null,null,{"$f":"IF(LEFT(S19,4)=\"Kürz\",-MIN(LEFT(RIGHT(S19,7),5)*1,L18),IF(AND($A$4=\"A\",S19=\"Übern.Pauschale AN 20 €\"),20,\"\"))","v":""},null,{"$f":"IF(ISERROR(VLOOKUP(S19,Kontenplan!$A$4:$B$156,2,0)),\" \",IF($A$4=\"A\",VLOOKUP(S19,Kontenplan!$A$4:$B$156,2,0),IF(ISERROR(VLOOKUP(S19,Kontenplan!$A$4:$C$156,3,0)),\" \",IF($A$4=\"U\",VLOOKUP(S19,Kontenplan!$A$4:$C$156,3,0),\" \"))))","v":" "}]
[null,{"$f":"IF(A19=\"\",B18,DATE(Jahr,RIGHT(A19,2),LEFT(A19,LEN(A19)-2)))","v":"2019-12-31"},null,null,"00:00:00","00:00:00",0,null,null,{"$f":"IF(OR(AND(C18=\"\",D18<>\"\"),AND(C19=\"\",D19<>\"\"),D18>2400,D19>2400,G18=\"X\",G19=\"X\"),\"Uhrzeit prüfen!\",IF(OR(AND(B17=B18,E18<F17),AND(A18<>\"\",B16=B18,E18<F16),AND(B18=B19,E19<F18)),\"Datum + Uhrzeit prüfen !\",IF(AND(E19+1-F18<>0,B18+1-B19=0),\"Datum + Uhrzeit prüfen !\",IF(AND(G18+G19>0,I18<=0),\"Geschäftspartner ?\",IF(AND(G18+G19>0,I19<=0),\"Reisezweck fehlt!\",IF(AND(G18+G19>0,J18<=0),\"Ort fehlt!\",IF(AND(G18+G19>0,J18=\" \"),\"Ort fehlt!\",\"\")))))))","v":""},null,{"$f":"IF(AND(D18>0,B18<=0),\"Datum fehlt !\",IF(AND(D19>0,B19<=0),\"Datum fehlt !\",IF(NOT(OR(B18=B19,B18+1=B19,B19<=0,)),\"Datum prüfen !\",IF(OR(AND(B17=B18,E18<F17),AND(B18=B19,E19<F18)),\"Datum + Uhrzeit prüfen !\",IF(AND(E19+1-F18<>0,B18+1=B19),\"Datum + Uhrzeit prüfen !\",IF(OR(AND(B18+1=B19,C18<1600),AND(B18+1=B19,D19>800)),\"Pauschale prüfen !\",\"\"))))))","v":""},{"$f":"IF(N18=\"J\",VLOOKUP(K18,Staaten!$A$7:$F$335,6,FALSE),\" \")","v":" "},null,null,null,null,null," "]
[null,{"$f":"IF(A20=\"\",B18,DATE(Jahr,RIGHT(A20,2),LEFT(A20,LEN(A20)-2)))","v":"2019-12-31"},null,null,"00:00:00","00:00:00",0,null,null,null," ",{"$f":"IF(OR(D20>2400,D21>2400,G20=\"X\",G21=\"X\"),\"Uhrzeit prüfen!\",IF(OR(J21<>\"\",L21<>\"\"),\"\",IF(AND(G20+G21>8/24,G20+G21<24/24),VLOOKUP(K20,Staaten!$A$7:$D$335,3,0),IF(OR(AND(B20-B18=1,D18=2400,ISNUMBER(C20),C20=0,G20<1),AND(B22-B20=1,C22=0,D20=2400,G20<1)),VLOOKUP(K20,Staaten!$A$7:$D$335,4,0),IF(G20+G21>=24/24,VLOOKUP(K20,Staaten!$A$7:$B$335,2,0),\"\")))))","v":""},{"$f":"IF(AND($A$4=\"A\",B20+100-B21<>0,N20=\"N\"),VLOOKUP(K20,Staaten!$A$7:$E$335,5,FALSE),IF(AND($A$4=\"U\",B20+100-B21<>0,N20=\"N\"),VLOOKUP(K20,Staaten!$A$4:$E$335,5,FALSE),\" \"))","v":" "},null,null,null,{"$f":"IF(LEFT(S21,4)=\"Kürz\",-MIN(LEFT(RIGHT(S21,7),5)*1,L20),IF(AND($A$4=\"A\",S21=\"Übern.Pauschale AN 20 €\"),20,\"\"))","v":""},null,{"$f":"IF(ISERROR(VLOOKUP(S21,Kontenplan!$A$4:$B$156,2,0)),\" \",IF($A$4=\"A\",VLOOKUP(S21,Kontenplan!$A$4:$B$156,2,0),IF(ISERROR(VLOOKUP(S21,Kontenplan!$A$4:$C$156,3,0)),\" \",IF($A$4=\"U\",VLOOKUP(S21,Kontenplan!$A$4:$C$156,3,0),\" \"))))","v":" "}]
{"$rows_left_out":61}
{"sheet":"VSt.Verpfl.","index":1,"n_rows":77,"n_cols":11,"rows_kept":77,"cut":false,"hidden":false,"merged":[[74,2,74,3],[5,6,5,10],[2,8,2,10],[3,1,3,3],[68,9,69,9],[68,10,69,10],[68,8,69,8],[6,7,6,8],[2,0,2,5],[68,6,69,6],[5,1,5,2],[68,7,69,7],[68,1,68,5],[5,3,5,4],[6,3,6,4],[7,3,7,4],[8,3,8,4]]}
[]
[]
["Vorsteuerabzug aus \nReisekosten-Abrechnung",null,null,null,null,null,null,null,{"$f":"Reisek.!P2","v":"Thomas Mustermann"}]
[null,{"$f":"Reisek.!J2","v":"2020-01-01"},null,null,null,{"$f":"Reisek.!L2","v":"2020-01-31"}]
[]
["Datum","Uhrzeit",null,"Stunden",null,"\nGeschäftspartner","Verpflegungsmehraufwand"]
[null,"von","bis",null,null,"Reisezweck","- Pauschale -","tatsächliche Kosten",null,"VSt.-Abzug aus","abziehbare VSt."]
[null,null,null,null,null,null,"€",{"$f":"G8","v":"€"},"% VSt.",{"$f":"G8","v":"€"},{"$f":"G8","v":"€"}]
[]
[{"$f":"IF(Reisek.!A10<=0,\" \",Reisek.!A10)","v":" "},{"$f":"IF(OR(Reisek.!E10=0,Reisek.!G10=0),\"\",Reisek.!E10)","v":""},{"$f":"IF(Reisek.!F10=0,\" \",Reisek.!F10)","v":" "},{"$f":"IF(Reisek.!G10=0,\" \",Reisek.!G10)","v":" "},null,{"$f":"IF(Reisek.!I10=\"\",\"\",Reisek.!I10)","v":""},{"$f":"IF(Reisek.!L10=\"\",0,Reisek.!L10)","v":0},null,null,{"$f":"IF(H10=\"\",\"\",IF(Reisek.!$A$4=\"U\",H10,IF(AND(Reisek.!$A$4=\"A\",(H10+H11)<=G10*(1+Reisek.!$A$70)),H10,\"\")))","v":""},{"$f":"IF(J10=\"\",\"\",ROUND(J10/(100+I10)*I10,2))","v":""}]
[{"$f":"IF(Reisek.!A11<=0,\" \",Reisek.!A11)","v":" "},{"$f":"IF(OR(Reisek.!E11=0,Reisek.!G11=0),\"\",Reisek.!E11)","v":""},{"$f":"IF(Reisek.!F11=0,\" \",Reisek.!F11)","v":" "},{"$f":"IF(Reisek.!G11=0,\" \",Reisek.!G11)","v":" "},null,{"$f":"IF(Reisek.!I11=\"\",\"\",Reisek.!I11)","v":""},null,null,null,{"$f":"IF(H11=\"\",\"\",IF(Reisek.!$A$4=\"U\",H11,IF(AND(Reisek.!$A$4=\"A\",(H10+H11)<=G10*(1+Reisek.!$A$70)),H11,\"\")))","v":""},{"$f":"IF(J11=\"\",\"\",ROUND(J11/(100+I11)*I11,2))","v":""}]
[{"$f":"IF(Reisek.!A12<=0,\" \",Reisek.!A12)","v":" "},{"$f":"IF(OR(Reisek.!E12=0,Reisek.!G12=0),\"\",Reisek.!E12)","v":""},{"$f":"IF(Reisek.!F12=0,\" \",Reisek.!F12)","v":" "},{"$f":"IF(Reisek.!G12=0,\" \",Reisek.!G12)","v":" "},null,{"$f":"IF(Reisek.!I12=\"\",\"\",Reisek.!I12)","v":""},{"$f":"IF(Reisek.!L12=\"\",0,Reisek.!L12)","v":0},null,null,{"$f":"IF(H12=\"\",\"\",IF(Reisek.!$A$4=\"U\",H12,IF(AND(Reisek.!$A$4=\"A\",(H12+H13)<=G12*(1+Reisek.!$A$70)),H12,\"\")))","v":""},{"$f":"IF(J12=\"\",\"\",ROUND(J12/(100+I12)*I12,2))","v":""}]
[{"$f":"IF(Reisek.!A13<=0,\" \",Reisek.!A13)","v":" "},{"$f":"IF(OR(Reisek.!E13=0,Reisek.!G13=0),\"\",Reisek.!E13)","v":""},{"$f":"IF(Reisek.!F13=0,\" \",Reisek.!F13)","v":" "},{"$f":"IF(Reisek.!G13=0,\" \",Reisek.!G13)","v":" "},null,{"$f":"IF(Reisek.!I13=\"\",\"\",Reisek.!I13)","v":""},null,null,null,{"$f":"IF(H13=\"\",\"\",IF(Reisek.!$A$4=\"U\",H13,IF(AND(Reisek.!$A$4=\"A\",(H12+H13)<=G12*(1+Reisek.!$A$70)),H13,\"\")))","v":""},""]
[{"$f":"IF(Reisek.!A14<=0,\" \",Reisek.!A14)","v":" "},{"$f":"IF(OR(Reisek.!E14=0,Reisek.!G14=0),\"\",Reisek.!E14)","v":""},{"$f":"IF(Reisek.!F14=0,\" \",Reisek.!F14)","v":" "},{"$f":"IF(Reisek.!G14=0,\" \",Reisek.!G14)","v":" "},null,{"$f":"IF(Reisek.!I14=\"\",\"\",Reisek.!I14)","v":""},{"$f":"IF(Reisek.!L14=\"\",0,Reisek.!L14)","v":0},null,null,{"$f":"IF(H14=\"\",\"\",IF(Reisek.!$A$4=\"U\",H14,IF(AND(Reisek.!$A$4=\"A\",(H14+H15)<=G14*(1+Reisek.!$A$70)),H14,\"\")))","v":""},""]
[{"$f":"IF(Reisek.!A15<=0,\" \",Reisek.!A15)","v":" "},{"$f":"IF(OR(Reisek.!E15=0,Reisek.!G15=0),\"\",Reisek.!E15)","v":""},{"$f":"IF(Reisek.!F15=0,\" \",Reisek.!F15)","v":" "},{"$f":"IF(Reisek.!G15=0,\" \",Reisek.!G15)","v":" "},null,{"$f":"IF(Reisek.!I15=\"\",\"\",Reisek.!I15)","v":""},null,null,null,{"$f":"IF(H15=\"\",\"\",IF(Reisek.!$A$4=\"U\",H15,IF(AND(Reisek.!$A$4=\"A\",(H14+H15)<=G14*(1+Reisek.!$A$70)),H15,\"\")))","v":""},""]
[{"$f":"IF(Reisek.!A16<=0,\" \",Reisek.!A16)","v":" "},{"$f":"IF(OR(Reisek.!E16=0,Reisek.!G16=0),\"\",Reisek.!E16)","v":""},{"$f":"IF(Reisek.!F16=0,\" \",Reisek.!F16)","v":" "},{"$f":"IF(Reisek.!G16=0,\" \",Reisek.!G16)","v":" "},null,{"$f":"IF(Reisek.!I16=\"\",\"\",Reisek.!I16)","v":""},{"$f":"IF(Reisek.!L16=\"\",0,Reisek.!L16)","v":0},null,null,{"$f":"IF(H16=\"\",\"\",IF(Reisek.!$A$4=\"U\",H16,IF(AND(Reisek.!$A$4=\"A\",(H16+H17)<=G16*(1+Reisek.!$A$70)),H16,\"\")))","v":""},""]
[{"$f":"IF(Reisek.!A17<=0,\" \",Reisek.!A17)","v":" "},{"$f":"IF(OR(Reisek.!E17=0,Reisek.!G17=0),\"\",Reisek.!E17)","v":""},{"$f":"IF(Reisek.!F17=0,\" \",Reisek.!F17)","v":" "},{"$f":"IF(Reisek.!G17=0,\" \",Reisek.!G17)","v":" "},null,{"$f":"IF(Reisek.!I17=\"\",\"\",Reisek.!I17)","v":""},null,null,null,{"$f":"IF(H17=\"\",\"\",IF(Reisek.!$A$4=\"U\",H17,IF(AND(Reisek.!$A$4=\"A\",(H16+H17)<=G16*(1+Reisek.!$A$70)),H17,\"\")))","v":""},""]
[{"$f":"IF(Reisek.!A18<=0,\" \",Reisek.!A18)","v":" "},{"$f":"IF(OR(Reisek.!E18=0,Reisek.!G18=0),\"\",Reisek.!E18)","v":""},{"$f":"IF(Reisek.!F18=0,\" \",Reisek.!F18)","v":" "},{"$f":"IF(Reisek.!G18=0,\" \",Reisek.!G18)","v":" "},null,{"$f":"IF(Reisek.!I18=\"\",\"\",Reisek.!I18)","v":""},{"$f":"IF(Reisek.!L18=\"\",0,Reisek.!L18)","v":0},null,null,{"$f":"IF(H18=\"\",\"\",IF(Reisek.!$A$4=\"U\",H18,IF(AND(Reisek.!$A$4=\"A\",(H18+H19)<=G18*(1+Reisek.!$A$70)),H18,\"\")))","v":""},""]
[{"$f":"IF(Reisek.!A19<=0,\" \",Reisek.!A19)","v":" "},{"$f":"IF(OR(Reisek.!E19=0,Reisek.!G19=0),\"\",Reisek.!E19)","v":""},{"$f":"IF(Reisek.!F19=0,\" \",Reisek.!F19)","v":" "},{"$f":"IF(Reisek.!G19=0,\" \",Reisek.!G19)","v":" "},null,{"$f":"IF(Reisek.!I19=\"\",\"\",Reisek.!I19)","v":""},null,null,null,{"$f":"IF(H19=\"\",\"\",IF(Reisek.!$A$4=\"U\",H19,IF(AND(Reisek.!$A$4=\"A\",(H18+H19)<=G18*(1+Reisek.!$A$70)),H19,\"\")))","v":""},""]
[{"$f":"IF(Reisek.!A20<=0,\" \",Reisek.!A20)","v":" "},{"$f":"IF(OR(Reisek.!E20=0,Reisek.!G20=0),\"\",Reisek.!E20)","v":""},{"$f":"IF(Reisek.!F20=0,\" \",Reisek.!F20)","v":" "},{"$f":"IF(Reisek.!G20=0,\" \",Reisek.!G20)","v":" "},null,{"$f":"IF(Reisek.!I20=\"\",\"\",Reisek.!I20)","v":""},{"$f":"IF(Reisek.!L20=\"\",0,Reisek.!L20)","v":0},null,null,{"$f":"IF(H20=\"\",\"\",IF(Reisek.!$A$4=\"U\",H20,IF(AND(Reisek.!$A$4=\"A\",(H20+H21)<=G20*(1+Reisek.!$A$70)),H20,\"\")))","v":""},""]
{"$rows_left_out":58}
{"sheet":"Staaten","index":2,"n_rows":30,"n_cols":7,"rows_kept":30,"cut":false,"hidden":false,"merged":[]}
["Dienst und Geschäftsreisen","mind. 24 Std.","weniger als 24 Std.","Tag vor oder nach","Pauschbetrag für","Kürzung für"," "]
[null,null,"aber mehr als 8 Std.","Übernachtung","Übernachtungsk.","Frühstück"," "]
[null,"€",{"$f":"B3","v":"€"},{"$f":"B3","v":"€"},{"$f":"B3","v":"€"},{"$f":"B3","v":"€"}," "]
[" ",{"$f":"IF(Jahr>=2020,28,24)","v":28},{"$f":"IF(Jahr>=2020,14,12)","v":14},14,0,{"$f":"B4*-0.2","v":-5.6000000000000005},"(Unternehmer)"]
["Inland",28,14,14,0,-5.6000000000000005,"(Unternehmer)"]
["Deutschland",28,14,14,0,-5.6000000000000005,"(Unternehmer)"]
["Inland",28,14,14,20,-5.6000000000000005,"(Arbeitnehmer)"]
["Deutschland",28,14,14,20,-5.6000000000000005,"(Arbeitnehmer)"]
[" ",28,14,14,20,-5.6000000000000005,"(Arbeitnehmer)"]
["nicht in Tabelle",47,32,32,130,-9.4,"(wie Luxemburg)"]
["Schiffsreise",47,32,32,130,-9.4,"(wie Luxemburg)"]
["Flugreise über 2 Tage",40,27,27,108,-8,"(wie Österreich)"]
[null,null,null,null,null,null," "]
[null,null,null,null,null,null," "]
[null,null,null,null,null,null," "]
[null,null,null,null,null,null," "]
[null,null,null,null,null,null," "]
[null,null,null,null,null,null," "]
[null,null,null,null,null,null," "]
[null,null,null,null,null,null," "]
{"$rows_left_out":11}
{"sheet":"Fahrzeug","index":3,"n_rows":7,"n_cols":3,"rows_kept":7,"cut":false,"hidden":false,"merged":[]}
["Fahrzeug","km-Satz"]
["Pkw",0.3]
["Motorr.",0.2,"(für Motorrad oder Motorroller)"]
["Krad",0.2,"(für Motorrad oder Motorroller)"]
["Moped",0.2]
["Mofa",0.2]
["Fahrrad",0.05]

{"sheet":"Kontenplan","index":4,"n_rows":261,"n_cols":3,"rows_kept":261,"cut":false,"hidden":false,"merged":[]}
["Kontenplan Reisekosten"]
[null,"Arbeitnehmer","Unternehmer"]
[null,"Konto","Konto"]
[" "," "," "]
["Autobahngebühren 0%","10 6650","10 6670"]
["Autobahngebühren 19%","90 6650","90 6670"]
["Benzin 0%","10 6530",{"$f":"B7","v":"10 6530"}]
["Benzin 19%","90 6530",{"$f":"B8","v":"90 6530"}]
["Betriebsbedarf 0%","10 6850",{"$f":"B9","v":"10 6850"}]
["Betriebsbedarf 19%","90 6850",{"$f":"B10","v":"90 6850"}]
["Bewirtung 0%","10 6640",{"$f":"B11","v":"10 6640"}]
["Bewirtung 19%","90 6640","90 6640"]
["Bürobedarf 0%","10 6815",{"$f":"B13","v":"10 6815"}]
["Bürobedarf 19%","90 6815",{"$f":"B14","v":"90 6815"}]
["Diesel 0%","10 6530",{"$f":"B15","v":"10 6530"}]
["Diesel 19%","90 6530",{"$f":"B16","v":"90 6530"}]
["Eintritt Messe 0%","10 6650","10 6670"]
["Eintritt Messe 19%","90 6650","90 6670"]
["Fahrkarte 0%","10 6650","10 6670"]
["Fahrkarte 19%","90 6663","90 6673"]
{"$rows_left_out":242}
{"sheet":"__Goal_Metadata","index":5,"n_rows":3,"n_cols":2,"rows_kept":3,"cut":false,"hidden":true,"merged":[]}
["_KAW999934","J"]
["_KAW999950","11.0.01"]
["_KAW999120","K0000133"]